Error Crystal Report

Solución al error al distribuir Crystal Reports.NET para.NET Framework 4

RECOMMENDED: If you have Windows errors then we strongly recommend that you download and run this (Windows) Repair Tool.

This document discusses how to troubleshoot common Crystal Report® errors in Solomon.

Feb 17, 2011. "Unknown Query Engine" is a very generic error generated by Crystal Reports. The error message does not provide any specific reasons for the.

Clang Error Linker Command Failed With Linker command failed with exit code 1. framework not found Mapbox clang: error: linker command failed with exit code 1. install at command prompt; < std::endl; } % clang++-mp-2.9 a.cc ld: unknown option: -demangle clang: error: linker command failed with exit code 1 (use -v to see invocation). ld: symbol(s) not found for architecture x86_64 clang: error: linker command failed

Crystal Reports viewer reports, "Failed to open the connection. Getting a vendor error means that you are connecting to some database, but perhaps don't.

Apr 30, 2017. When printing reports if you receive one of the following error messages it means your Crystal Reports driver (which should get created.

“I’m speechless,” Colon said, speaking to Agruso. “Will you come back at the next meeting and give us an updated report?” Agruso assured him she would. New.

Jun 05, 2007  · Dear All, I have Crystal Reports developed in Version 7.0. These reports are operating on Data Push model where I am pushing the dataset to the Crystal Report.

Opensta Error 10054 Clang Error Linker Command Failed With Linker command failed with exit code 1. framework not found Mapbox clang: error: linker command failed with exit code 1. install at command prompt; < std::endl; } % clang++-mp-2.9 a.cc ld: unknown option: -demangle clang: error: linker command failed with exit code 1 (use -v to see invocation). ld: symbol(s) not found for architecture
Error In Createouiprocess Error in CreateOUIProcess(): 1260 win64_11gR2_client. Welcome to this forum. Please read and follow the forum guidelines, to enable us to help you: 6 avr. 2011. En cas d'erreur : Error in CreateOUIProcess(): 13 : Permission denied. Modifier / etc/fstab pour autoriser l'exécution de script dans /tmp (sur la. Oracle for Linux インストール HOWTO: インストーラ – Linux JF – インストールプログラムが 'CreateOUIProcess()'

Texas – and Crystal’s unborn baby, nicknamed Billy Bob by the family. With a warm embrace, Pence thanked Stephen Willeford, the man who shot at gunman Devin.

Have you recently upgraded iMIS and now some of your custom Crystal Reports are not working anymore? If you are getting an error message it could mean.

Jan 24, 2006  · I am using Crystal 11 and publish through the console manager. I have a report that displays fine in Crystal, but when I publish it I get an error Database Conn

Often, the best way to prevent an error is to understand why it occurs. In various newsgroups, questions regarding the Crystal Reports LogOnException are asked quite.

When I call ExportToDisk(). In some machine do well. But in some machine throw the exception. Exceptoion This field name is not known. Error in File C:\Windows.

A new report details the events that led. The collision between the Fitzgerald and ACX Crystal, the U.S. Navy has determined, was avoidable and resulted from an accumulation of smaller errors over time, ultimately resulting in a.

Browse our directory of "Crystal Reports" errors and learn how to fix these Runtime Errors quickly and easily.

Jan 11, 2016. PDF file nothing happens OR the user gets the following error:. In Crystal Reports version 9 (Crystal 9) and version 10 (Crystal 10), the "export.

World – John Richardson, Chief of Naval Operations (CNO), said. The report showed that the collision between Fitzgerald and Crystal was avoidable and resulted from.

Error 1606 problems include computer crashes, freezes, and possible virus infection. Learn how to fix these Crystal Reports runtime errors quickly and easily!

Why do I receive an Unable to connect to server error message when I try to connect to a Crystal Reports server from WebSphere Business.

Most likely you are not using your {@ClientName} formula anywhere on report; Crystal Reports tends to ignore unused fields, formulas etc. Place {@ClientName} field.

Understanding Crystal Report Viewers – C# Corner – Crystal Report Viewers work as a container of a report and allow us to view a crystal report in Windows and Web applications. Crystal Reports for Visual Studio.NET.

RECOMMENDED: Click here to fix Windows errors and improve system performance

Error Code 1753

48RE Transmission -  P1751, P1753, P1757 - Transmission Repair

RECOMMENDED: If you have Windows errors then we strongly recommend that you download and run this (Windows) Repair Tool.

Error Crystal Report This document discusses how to troubleshoot common Crystal Report® errors in Solomon. Feb 17, 2011. "Unknown Query Engine" is a very generic error generated by Crystal Reports. The error message does not provide any specific reasons for the. Clang Error Linker Command Failed With Linker command failed with exit code 1. framework not found Mapbox clang: error: linker command failed

BRISBANE City Council has been scammed out of more than $450,000 by fraudsters over a few weeks. Investigators were called in after the council became aware of the scam late last week. Lord Mayor Graham Quirk said the fraud.

Liftmaster 8550 Error Code 1 4. Web; News;. http://chamberlain.custhelp.com/app/answers/detail/a_id/1753. http://www.yaelp.com/s_Liftmaster+8550+Error+Code+1+4.

The error values identified in this topic are returned by GetLastError when one of the Microsoft Windows HTTP Services (WinHTTP) functions fails.

I’m using the DbContext and Code First APIs introduced with Entity Framework 4.1. The data model uses basic data types such as string and DateTime. The only data.

I KNEW that I loved him by the end of our third date. Over dinner at a simple Italian restaurant in Sydney’s inner-east on a midweek evening in autumn, he began to gently weep while talking about the impact of his work as a clinical.

I’ve been using this piece of code I’ve written and it’s working in this most unclear manner. I wish to insert a row into the database which includes two columns of.

Apr 30, 2011. If you get error message: Windows could not start the Windows Firewall on Local Computer, this post will help you troubleshoot the issue.

How to: Use MySQL fast LOAD DATA for UPDATEs – How to: Use MySQL fast LOAD DATA for UPDATEs Programming

A complete list of system error codes, from code 1 through 15841. Here, too, are meanings for each system error code, plus other ways they may appear.

AUSTRALIAN children are more afraid of bullying than anything else, according to new Census data and that will not surprise Olympic taekwondo champion Tiffiny Hall, Aria award-winning singer Missy Higgins, or comedian Charlie.

If this is a non-Microsoft service, contact the service vendor, and refer to service- specific error code 5. Now I read a couple of posts and they.

exchange calendar connector error code 1753 (Русский)ישראל (עברית)المملكة العربية السعودية (العربية)ไทย (ไทย.

As Kegel notes, Massoud was the victim of "a cruel deception–for all the violence of long years of war, suicide attacks had been unknown in Afghanistan, in part because they violate the tribal code of honor. there was an error.

LTC2600/LTC2610/LTC2620 1 2600fe BLOCK DIAGRAM DESCRIPTION Octal 16-/14-/12-Bit Rail-to-Rail DACs in 16-Lead SSOP The.

A complete list of system error codes, from code 1 through 15841. Here, too, are meanings for each system error code, Error Code 1753:.

Installation error: "Windows could not assemble the foundation image being installed." View Error This error typically. Description: The service has returned a service-specific error code. Code: 1067. Code: 1753. Description: There are no.

Jan 25, 2016. An AppleScript error is an error that occurs when AppleScript processes. The script isn't a supported type. -1753. A script error has occurred.

RECOMMENDED: Click here to fix Windows errors and improve system performance

Error Ngm Module

Resolver Error to find NGM Module CA BR

RECOMMENDED: If you have Windows errors then we strongly recommend that you download and run this (Windows) Repair Tool.

Chi-squared Error Criterion SEM: Fit (David A. Kenny) – The major reason for computing a fit index is that the chi square is statistically significant, Root Mean Square Error of. Akaike Information Criterion. Jul 19, 2014. A family of Root Mean Square Error of Approximation (RMSEA) statistics is proposed for. IRT models, we provide cutoff criteria of adequate, good, and excellent. a chi-square

Ad blocker interference detected! Wikia is a free-to-use site that makes money from advertising. We have a modified experience for viewers using ad blockers

View and Download Arizona Hydrogen Sulfide Analyzer Jerome 631-X operation manual online. Arizona Instrument Hydrogen Sulfide.

The Moon is the eye in the sky to the inhabitants of Earth. It provides us with the natural tidal cycles which are said to maintain the equ.

Visit your computer memory experts online at Memorydepot.com today! With portable flash memory, USB, SATA & IDE Disks on Module, we have everything you need.

Ms. Bale, a reporter for National Geographic’s Wildlife Watch. Leighton.

The most exciting adventure in human memory now neared its climax as the two men prepared to step out on the lunar surface, while their fellow crew member, Mike Collins, kept vigil in his orbiting command module. and a National.

Resolver Error to find NGM Module (how to fix the error to find NGM Module) Link para Blog: http://pressstart1.blogspot.com.br/2012/06/error-to-find-ngm.

Make sure that your firewall and anti-virus software are set to allow Combat Arms. I keep getting this error: "Cannot locate NGM module". What does this mean? There are numerous reasons why this could be happening. A first step.

Lag Spikes · A FANDOM user • November 4, 2016. MapleStory error code : 11004 · A FANDOM user • October 26, 2016. ERROR CODE = -40 (11315, -105).

I fix many computer problems and sometimes the answer is very hard to find. This blog is all about problem fixes. This is not a personal blog, and if you.

**must read** combat arms could not find ngm module and yes i have BF2 and BF2 AIX mod if you wont to battle me i gave you my e-mail did i not? (that means.

CA – Error to find NGM module; GetDeviceCaps(). Reinstalling the Nexon Game Manager. Edit. Delete the NGM folder;

MSI P6NGM-FIH – Motherboard – Micro ATX User Manual – View and Download MSI P6NGM-FIH – Motherboard – Micro ATX user manual online. P6NGM series MS-7366 (v1.X) Mainboard. P6NGM-FIH – Motherboard – Micro ATX.

Oct 09, 2017  · I migrated an FWSM firewall to Checkpoint. The management server is on R80.10 and the gateways are running on R77.30. The FWSM had a.

. Windows Explorer. Delete the NGM folder; Re-Install NGM from this download:. Nexon Game Manager error logs Nexon CommunityTech Wiki · Nexon Game.

There are numerous reasons why this could be happening. A first step would be to reboot your computer. If that did not solve the issue,

Cmake Error The Source Directory Does Not Match How to build OpenCV from source for VC14 – Amin – Dec 4, 2015. OpenCV 2.4.11 users may have noticed that it does not provide pre-built. Note 1: This guide is already tested with CMake 3.4.1, OpenCV. Source codes are in the existing folder that can be found inside. To be honest I have never faced such an error and

Dec 15, 2008. Make sure that your firewall and anti-virus software are set to allow Combat Arms. I keep getting this error: "Cannot locate NGM module".

Historic words and photographs by Neil A. Armstrong and Edwin E. Aldrin, Jr, and Michael Collins.

RECOMMENDED: Click here to fix Windows errors and improve system performance

Error Number 1016

Diablo 3 1016 error

RECOMMENDED: If you have Windows errors then we strongly recommend that you download and run this (Windows) Repair Tool.

Error 10106 problems include computer crashes, freezes, and possible virus infection. Learn how to fix these Windows Update runtime errors quickly and easily!

A complete list of system error codes, Error Code 553: The number of active profiling objects is at the maximum and no more may be. Error Code 1016:.

The number of fraud victims increased by 3% in 2015 to its second highest level in 6 years, according to statistics from Javelin Strategy & Research. In all, 41 million U.S. adults have had their identities stolen, according to Bankrate’s.

Home; Forum; vBulletin Legacy Versions & Products; Legacy vBulletin Versions; vBulletin 3.6 Questions, Problems and Troubleshooting; Join us on Facebook, Twitter and.

The TIRS sensor had been added to the Landsat 8 payload specifically because it.

Bolshevik Revolution – with 46 percent saying it served interests of the majority and the same number responding that only a few benefited; the rest were undecided. The poll of 1,800.

Error Ngm Module Chi-squared Error Criterion SEM: Fit (David A. Kenny) – The major reason for computing a fit index is that the chi square is statistically significant, Root Mean Square Error of. Akaike Information Criterion. Jul 19, 2014. A family of Root Mean Square Error of Approximation (RMSEA) statistics is proposed for. IRT models, we provide cutoff criteria of adequate, good, and

#amazon customer service phone number+1_844_679_1016 #amazon prime customer service telephone number+1_844_679_1016 "prime video help" ,

I made your suggested change and received the following error: FastCGI Error The FastCGI Handler was unable to process the request. Error Details:

Error 1016 when trying to install Management Point role. System Center Configuration Manager > Configuration Manager 2007 General. Configuration Manager.

Sorry but confused how that is a clue to solving the problem.? From that link it looks like a mysterious intermittent bug that is not solved, just.

How To Fix (Error 1016) – wiki-errors.com – The 1016 error is the numerical value of the error occurred. The error number is one of the value to identify the error. It holds information about the error, the possible cause of the error, the action that caused the error.

Sep 21, 2017. Error codes below relate to Early Warning System (EWS):. Error number. Error message. 1016, Unable to download test content. TestNav.

Aug 05, 2012  · i’ve got a 2008 R2 server running Exchange 2010 and during the first few minutes of start up a number of event 1016’s are being logged by the MSExchange.

Error: This expression has type float but an expression was expected of type int. has type my_type/1020 but an expression was expected of type my_type/1016. This warning should be considered as an error, since there is no reason to.

IIS ODBC Logging Event ID 1016 (error data 80070057) – Apr 16, 2009  · “The World Wide Web Publishing Service (WWW Service) did not configure logging for site X. The data field contains the error number…

tion error occurs when the quantity of cells of a category in. Photogrammetric Engineering & Remote Sensing. Vol. 66, No. 8, August 2000, pp. 1011-1016.

OctoPrint is the snappy web interface for your 3D printer!

RECOMMENDED: Click here to fix Windows errors and improve system performance

Error In Createouiprocess

Oracle Forms Lesson 10 - Oracle universal installer

RECOMMENDED: If you have Windows errors then we strongly recommend that you download and run this (Windows) Repair Tool.

Error in CreateOUIProcess(): 1260 win64_11gR2_client. Welcome to this forum. Please read and follow the forum guidelines, to enable us to help you:

6 avr. 2011. En cas d'erreur : Error in CreateOUIProcess(): 13 : Permission denied. Modifier / etc/fstab pour autoriser l'exécution de script dans /tmp (sur la.

Oracle for Linux インストール HOWTO: インストーラ – Linux JF – インストールプログラムが 'CreateOUIProcess()' と言って終了してしまいます。. error in loading shared libraries: libclntsh.so.8.0: cannot open shared object file: No.

3 abr. 2013. ERROR: ORA-01033: ORACLE initialization or shutdown in progress. Isso é porque o seu banco de dados se encontra em status NOMOUNT.

The oraInventory being pointed to through the inventory_loc reference in the /var/opt/oracle/oraInst.loc file problem! Effective data visualization crystallizes a.

Mar 03, 2012  · Hi, I’ve just started getting the message ‘Runtime Error 216 at 004045a6’ whenever I try to open a program called mp3 book.

In my case, I changed this variable to D:\temp and, after that, I was able to lanch the installer as expected.

Oracle Error in CreateOUIProcess():5 Can anyone please guide me. I am getting this error when starting Oracle 10g Rel2 client setup on Windows XP machine. Error in.

Dec 3, 2014. Sometimes the script run fails and throws java.io.IOException: error=26, Text file busy. STEPS TO FOLLOW TO REPRODUCE THE PROBLEM :

Error Number 1016 Error 10106 problems include computer crashes, freezes, and possible virus infection. Learn how to fix these Windows Update runtime errors quickly and easily! A complete list of system error codes, Error Code 553: The number of active profiling objects is at the maximum and no more may be. Error Code 1016:. The number of fraud victims increased by 3% in
Mac Disc Utility Medium Write Error Jul 4, 2012. i burn a disc and it says: the attempt to burn a disc failed , the burn failed because of a medium write error- what can i do? i erased the disc as. i like these cos they last for longer. i used disc utility to erase, not used any other. Error Number 1016 Error 10106 problems
Error Ngm Module Chi-squared Error Criterion SEM: Fit (David A. Kenny) – The major reason for computing a fit index is that the chi square is statistically significant, Root Mean Square Error of. Akaike Information Criterion. Jul 19, 2014. A family of Root Mean Square Error of Approximation (RMSEA) statistics is proposed for. IRT models, we provide cutoff criteria of adequate, good, and

2016年5月18日. 04-19 12:35:59 E/RunUtil: Cannot run program "aapt": error=13, Permission. 安装oracle时提示Error in CreateOUIProcess(): 13 : Permission.

Installation Error in CreateOUIProcess(): -1 $./runInstaller Initializing Java Virtual Machine from /usr/local/jre/bin/jre. Please wait. Error in CreateOUIProcess.

Database support blog provides information on oracle database architecture and instance memory background process.Listed various ORA- TNS- errors backup restoration.

runInstaller fails at CreateOUIProcess with permission denied. January 16th, 2015 Svetoslav Gyurov Leave a comment Go to comments. Below is the exact error:

OUI: RHEL Permission Denied error. 30 de June de 2015 31 de January de 2017 matheusboesing Leave a comment. Error in CreateOUIProcess(): 13 :.

Check the file permission of the java which will execute the oui the java of the run installer can be located in the /tmp/OraInstall

RECOMMENDED: Click here to fix Windows errors and improve system performance

Mac Disc Utility Medium Write Error

MacBook burn disc read error

RECOMMENDED: If you have Windows errors then we strongly recommend that you download and run this (Windows) Repair Tool.

Jul 4, 2012. i burn a disc and it says: the attempt to burn a disc failed , the burn failed because of a medium write error- what can i do? i erased the disc as. i like these cos they last for longer. i used disc utility to erase, not used any other.

Error Number 1016 Error 10106 problems include computer crashes, freezes, and possible virus infection. Learn how to fix these Windows Update runtime errors quickly and easily! A complete list of system error codes, Error Code 553: The number of active profiling objects is at the maximum and no more may be. Error Code 1016:. The number of fraud victims increased by 3% in

Mar 12, 2007. Keywords: iDVD Burn, DVD Burn, DVD+R, DVD-R, media, Medium Error, Power calibration area error, Macintosh OS X, Mac OS X. the left), then navigate into the "Utilities" folder, then double-click on the "Console" program.

Your Mac is full of. all Flash/SSD and hard disk drives used in Apple products use Error Correcting Code (ECC). ECC checks for transmission errors, and when.

Error Ngm Module Chi-squared Error Criterion SEM: Fit (David A. Kenny) – The major reason for computing a fit index is that the chi square is statistically significant, Root Mean Square Error of. Akaike Information Criterion. Jul 19, 2014. A family of Root Mean Square Error of Approximation (RMSEA) statistics is proposed for. IRT models, we provide cutoff criteria of adequate, good, and

You will open Disk Utility and select Erase. The first time you try to format the disk, you may receive an error message and when you remount the drive on your.

TheINQUIRER publishes daily news, reviews on the latest gadgets and devices, and INQdepth articles for tech buffs and hobbyists.

Medium Write Error for CDs | Sound Bytes – Medium Write Error for CDs. I tried downloading RealPlayer only to find out that the Mac version doesn't write CDs!!. using Disk Utility to burn the ISO.

. Mac OS X (10.5.6. Q: What is "Medium write error"??? Hide Question. Helpful. I use Disk Utility for DVDs and where the window asks for speed of.

Oct 18, 2012. I just bought Toast 11 and tried to burn a DVD from Final Cut Pro X. I used "Share " to make an MOV file. Sense Key = MEDIUM ERROR. Burning disk images in Disk Utility usually but not always work. but when the encoding starts, either toast 11 crashes or an error "Mac OS result code = -39" appears

Mac; iPad; iPhone; Watch; TV; Music; Support;. or with disk utility. I get this message:. The burn failed because of a medium write error."

I find my Mac always gives an error when using 24x write. and only after reducing the write speed of Disk Utility from 24x to 10x did it. Medium write error?

I tried Verifying and Repairing in Disk Utility but both came up with an error about the B-Tree node being invalid. and I emphasize ‘sometimes’, shows that I can only read, not write. Other times it says read and write so I’m confused.

Cannot burn DVDs — Medium write error. If I use disk utility or Toast to burn an ISO, med/write error mac book air 13" -2010

Latest trending topics being covered on ZDNet including Reviews, Tech Industry, Security, Hardware, Apple, and Windows

Luckily, installing macOS High Sierra won’t automatically convert Time Machine.

Chi-squared Error Criterion SEM: Fit (David A. Kenny) – The major reason for computing a fit index is that the chi square is statistically significant, Root Mean Square Error of. Akaike Information Criterion. Jul 19, 2014. A family of Root Mean Square Error of Approximation (RMSEA) statistics is proposed for. IRT models, we provide cutoff criteria of adequate, good, and excellent. a chi-square

Inside Social. The biggest and latest apps and platforms, plus trends and insights on the biggest online discussions

RECOMMENDED: Click here to fix Windows errors and improve system performance

Validatoronchangeevent Error

Bride Can't Stop Laughing During Wedding Vows

RECOMMENDED: If you have Windows errors then we strongly recommend that you download and run this (Windows) Repair Tool.

Nov 9, 2013. <asp:TextBox ID="TextBox1" runat="server" onblur="myValidatorOnChange( event);"></asp:TextBox> <script type="text/javascript"> function.

c# – Validate on text change in TextBox – Stack Overflow – Mar 4, 2009. TextChanged event. in the future you can find all of the events on the MSDN library, here's the TextBox class reference:.

Error Code 6073 Quickbooks The error is usually followed by 3 or 4 more digits and an error message indicating. -6073, -816, Multiple computers are hosting the file or it could be firewall. Apr 2, 2017. Title: What is quickbooks enterprise error 6073 and how to fix it, Author: Daniel Cooper, QB Enterprise error code 6073 is an identical error. Quickbooks from Intuit is
Error C2018 Unknown Character Error 3265 Access Vba When you really stop to think about it, an Internet browser. Access or Excel to read HTML documents on the web, alter those documents, and then output whatever you want in a new browser window. It may sound like something that. Typically, linking an Access front-end to tables in some other DBMS involves using a Data

Jan 29, 2014. The error message will show up, but then when another field is focused, the error class disappears from the element (well the element wrapper).

html – Validating a text field using onchange event? – Stack. – Validating a text field using onchange event?. In order to do this I have called the validate method on the onchange event of. Can you use memory errors as a.

How can I set up my validator so it will check all fields on the form whenever changes the value of any input on this form. I've tried $("#form-user-edit").validate.

Validation trigger on "Change" event · Issue #997 · jquery. – Validation trigger on "Change" event #997. the error class disappears from the. Would it be possible to have validator also listen to on change events as.

Feb 24, 2014. ID="rfvCompany2" runat="server" ControlToValidate="txtCompany2" errormessage="Please indicate which company you worked for.

RECOMMENDED: Click here to fix Windows errors and improve system performance

Cmake Error The Source Directory Does Not Match

Building Science with CMake

RECOMMENDED: If you have Windows errors then we strongly recommend that you download and run this (Windows) Repair Tool.

How to build OpenCV from source for VC14 – Amin – Dec 4, 2015. OpenCV 2.4.11 users may have noticed that it does not provide pre-built. Note 1: This guide is already tested with CMake 3.4.1, OpenCV. Source codes are in the existing folder that can be found inside. To be honest I have never faced such an error and to me it doesn't seem to be related to OpenCV.

Overview. Introduction; Tutorial; Compilation Tutorial; Release Notes; Compatibility; Incompatibilities; Speedup; Perl Performance; Q&A. Cookbook; FAQ; Features.

I just installed the Qt 5.1.1 for Windows 32-bit (MinGW 4.8, OpenGL) and tried to add it to my cmake. But CMake just does not want to find it and i dont know why.

Problem with using Cmake in sub directories after. CMakeLists.txt" does not match the source "C:. source directory as its main argument is an error,

Typical GROMACS installation. As above, and with further details below, but you should consider using the following CMake options with the appropriate value instead.

directory. no origin-based match is found, columns are matched by using the.

Error Undefined Offending Command Stack Pdf User’s Manual for Macro Assembler AS – Alfred Arnold, Stefan Hilse, Stephan Kanthak, Oliver Sellke, Vittorio De Tomasi. Macro Assembler AS V1.42 This web page provides step by step instructions on how to create a simple but functional PDF Writer on Windows 98/2000/XP using the freely available Ghostscript and. Error Messages: ERROR: undefined result. OFFENDING COMMAND: setcachedevice. Stack: 10 10

[CMake] Copying directories and build error. The source "/myProjCopy/CMakeLists.txt" does not > match the source. > Re-run cmake with a different source directory.

cmake [options] <path-to-source> cmake [options] <path-to-existing-build>. -U < globbing_expr> Remove matching entries from CMake cache. Do not delete the files and directories created for try_compile calls. This is. It should be specified so CMake versions 2.4 and lower fail with an error instead of just a warning.

Validatoronchangeevent Error Nov 9, 2013. <asp:TextBox ID="TextBox1" runat="server" onblur="myValidatorOnChange( event);"></asp:TextBox> <script type="text/javascript"> function. c# – Validate on text change in TextBox – Stack Overflow – Mar 4, 2009. TextChanged event. in the future you can find all of the events on the MSDN library, here's the TextBox class reference:. Error Code 6073 Quickbooks The error is usually followed by 3 or 4

This tool allows you to definitively determine the source of nearly any error, provided you educate yourself on. and logical operators in order to filter out packets that do not match the criteria. For example, the filter http will only.

CMake error when building OpenCV – CMakeLists not match – CMake error when building OpenCV – CMakeLists not. 1./CMakeLists.txt" does not match the source "/home/pi/Downloads. cmake with a different source directory.

Sep 5, 2013. Did you do "dir %IPPROOT%"?. CMake Error: The source directory. -codecs. ia32.xcode.s.mt/resources/sip/ipp-samples.7.1.1.013/sources/speech-codecs" does not exist. if(NOT IPP_LIBRARY MATCHES NOTFOUND)

To get started with this create a file main.cpp in a folder on your PC, add the source below to it. option is not necessary but is useful to know about if you are trying to diagnose an issue. You can do anything you like with remote tasks of.

Feb 21, 2015. You can substitute the path to match your systems. Linux:. I have created a folder "build" in the source tree of the addon. Change to addon's build. Do not e -mail Team Kodi members directly asking for support. Read/follow the forum. make[2]: *** [CMakeFiles/pvr.hts.dir/src/HTSPDemuxer.cpp.o] Error 1

CMakeSetup request me to enter a source and binary directory >but not a. Now comes up an >error message > > CMake. txt > Does not match source used to.

Highest Voted 'cmake' Questions – Ask Ubuntu – CMake is a cross-platform, open-source make system. What package do I need to build a Qt 5 & CMake application?. Ubuntu 14.10 64-bit I am getting this error while running cmake in gromacs build directory CMake Error: Could not find CMAKE_ROOT !!!. I have installed QT4.8.7 but CMAKE could not match the path.

RECOMMENDED: Click here to fix Windows errors and improve system performance

Error Undefined Offending Command Stack Pdf

RECOMMENDED: If you have Windows errors then we strongly recommend that you download and run this (Windows) Repair Tool.

User’s Manual for Macro Assembler AS – Alfred Arnold, Stefan Hilse, Stephan Kanthak, Oliver Sellke, Vittorio De Tomasi. Macro Assembler AS V1.42

This web page provides step by step instructions on how to create a simple but functional PDF Writer on Windows 98/2000/XP using the freely available Ghostscript and.

Error Messages: ERROR: undefined result. OFFENDING COMMAND: setcachedevice. Stack: 10 10 -10 -10 0 1 /.notdef -dictionary- -savelevel-. that printing a PDF file displayed in Chrome is yielding this PostScript error?

Mar 28, 2017. PostScript error undefined offending command -some number-. One of the. I am having an issue converting my pmd (pagemaker) files to pdf. PS interpreter tries to look up a name but cannot find it on the dictionary stack.

Feb 6, 2013. ERROR: undefinedresult OFFENDING COMMAND: itransform. "STACK" is a programming term used to describe functions currently in use to. I would say that something happened when the PDF was being created, some.

The commanding general of the U.S. Army installation management command said they are a great addition. "I believe candidly we can accelerate the evolution of technology," Lynch said. "I contend there are things we can do to improve.

Jul 23, 2011. List of PostScript error and offending command problems to troubleshoot or. First I got this error printing.ps file (I convert to.pdf to solve), after also.txt, now all file. “ERROR: undefined. OFFENDING COMMAND:beg. Stack:

How to solve and work around postscript error offending command stack. “ ERROR: undefined. OFFENDING COMMAND: STACK:”. It never lists the offending command or stack. This happens when you print. No PDF file produced. ] %%

Copyright © 2006 Pearson Education, Inc., publishing as Benjamin Cummings Stages of Endochondral Ossification Figure 6.8 Formation of bone collar

Apr 25, 2013  · When printing a PowerPoint Presentation to our Xerox 5150 Workcentere, it will print about half of presentation then it prints the following error: ERROR.

Error C2018 Unknown Character Error 3265 Access Vba When you really stop to think about it, an Internet browser. Access or Excel to read HTML documents on the web, alter those documents, and then output whatever you want in a new browser window. It may sound like something that. Typically, linking an Access front-end to tables in some other DBMS involves using a Data

When a Global Graphics (Harlequin) RIP generates an 'undefined' PostScript error, offending command 'get' when processing a PDF coming from Adobe.

My wife and I try to divide our household chores equally: She cooks, I do the dishes. She buys groceries, I do the laundry. My easiest chore is setting the table. It takes about one minute and she has to remind me every time. The problem.

I'm receiving a mysterious error when printing a.PDF. The exact message it prints out (wrong linebreaks) is: ERROR: undefinedresult OFFENDING COMMAND.

Police search a vehicle outside the home of Devon Arthurs and Brandon Russell in Tampa Palms, Florida (Screenshot from WFLA News Channel 8) The case of the neo-Nazi in Tampa, Florida who converted to Islam and killed his two neo-Nazi.

If 95, 96 or 97% of scientists say that human activity is driving the world temperature higher, why is it that some people reject the view of the overwhelming majority? Stephan Lewandowsky has studied scepticism. In the field of climate.

The slightly redesigned 2019 Porsche Cayenne isn’t supposed to make its way before our eyes until Tuesday, but Fridays are more fun anyway. Here, have a look at some recently leaked photos that appear to be it. Stay awhile, if you’d like.

I went out on the streets of New York City to ask the people a question that has burned game-likers’ brains since the announcement of the upcoming Super Mario Odyssey: is Mario a human? I promise I’m getting a haircut really soon,

Validatoronchangeevent Error Nov 9, 2013. <asp:TextBox ID="TextBox1" runat="server" onblur="myValidatorOnChange( event);"></asp:TextBox> <script type="text/javascript"> function. c# – Validate on text change in TextBox – Stack Overflow – Mar 4, 2009. TextChanged event. in the future you can find all of the events on the MSDN library, here's the TextBox class reference:. Error Code 6073 Quickbooks The error is usually followed by 3 or 4

Follow these steps to troubleshoot PostScript errors you may receive. locate the error type and offending command in the "PostScript Error Types" and. undefined.

ERROR: undefined, OFFENDING COMMAND:. Still same error while printing. If I save it to a PDF file, Offending Command Stack error new problem after installing.

RECOMMENDED: Click here to fix Windows errors and improve system performance

Chi-squared Error Criterion

Pearson's chi square test (goodness of fit) | Probability and Statistics | Khan Academy

RECOMMENDED: If you have Windows errors then we strongly recommend that you download and run this (Windows) Repair Tool.

SEM: Fit (David A. Kenny) – The major reason for computing a fit index is that the chi square is statistically significant, Root Mean Square Error of. Akaike Information Criterion.

Jul 19, 2014. A family of Root Mean Square Error of Approximation (RMSEA) statistics is proposed for. IRT models, we provide cutoff criteria of adequate, good, and excellent. a chi-square distribution with C − q − 1 degrees of freedom.

This is the class and function reference of scikit-learn. Please refer to the full user guide for further details, as the class and function raw specifications may.

Definition of Mean Squared Error. Sample problem for finding the Mean Squared Error. Statistics explained simply. Step by step videos, articles.

Error Undefined Offending Command Stack Pdf User’s Manual for Macro Assembler AS – Alfred Arnold, Stefan Hilse, Stephan Kanthak, Oliver Sellke, Vittorio De Tomasi. Macro Assembler AS V1.42 This web page provides step by step instructions on how to create a simple but functional PDF Writer on Windows 98/2000/XP using the freely available Ghostscript and. Error Messages: ERROR: undefined result. OFFENDING COMMAND: setcachedevice. Stack: 10 10

ANOVA, Regression, and Chi-Square. variables (high school GPA, SAT scores , and college major) were related to the criterion variable (college GPA).

Investigating Writing Sub-skills in Testing English as a Foreign Language: A Structural Equation Modeling Study Vahid Aryadoust National Institute of Education, Singapore

se array of standard error estimates for all parameter estimates. The reference distribution is an appropriate chi-squared when the scale parameter is known, and is based on an F when it is not. The p-values are approximate and.

The original chi-square test, often known as Pearson's chi-square, dates from. the error, and Pearson and Fisher were enemies for the rest of their lives.).

CHI-SQUARE: TESTING FOR GOODNESS OF FIT. not the square of some quantity ˜. It is therefore not chi squared, but chi-square. The notation is

Validatoronchangeevent Error Nov 9, 2013. <asp:TextBox ID="TextBox1" runat="server" onblur="myValidatorOnChange( event);"></asp:TextBox> <script type="text/javascript"> function. c# – Validate on text change in TextBox – Stack Overflow – Mar 4, 2009. TextChanged event. in the future you can find all of the events on the MSDN library, here's the TextBox class reference:. Error Code 6073 Quickbooks The error is usually followed by 3 or 4
Cmake Error The Source Directory Does Not Match How to build OpenCV from source for VC14 – Amin – Dec 4, 2015. OpenCV 2.4.11 users may have noticed that it does not provide pre-built. Note 1: This guide is already tested with CMake 3.4.1, OpenCV. Source codes are in the existing folder that can be found inside. To be honest I have never faced such an error and

An introductory statistics text for the social sciences

Issuu is a digital publishing platform that makes it simple to publish magazines, catalogs, newspapers, books, and more online. Easily share your publications and get.

Your Chi-Square Test is Statistically Significant:. squared standardized residuals is the chi-square. error rather than the estimated standard deviation of

The authors acknowledged this minor error and issued a correction. Now, it emerges that there may be more serious problems with the PNAS paper. In a letter published last week, researchers Patrick Jern and colleagues say that the.

Problems of correlations between explanatory variables in multiple regression analyses in the dental literature – Appropriate statistical methods, such as the chi-squared test, should be used to detect the association between.

Jul 12, 2005. In a chi-squared approach, we see how close the observed. an illustration, here's a case where the sum-squared error criterion gives an.

The chi-square (I) test is used to determine whether there is a significant difference. expected and observed due to sampling error, or is it a real difference?

In regression analysis, the term mean squared error is sometimes used to refer to the unbiased estimate of error variance: the residual sum of squares divided by the.

RECOMMENDED: Click here to fix Windows errors and improve system performance

1 66 67 68 69 70 739