Nsis Compiler Error 12345

Fix the error ‘NSIS Installer Integrity check' while installing McAfee® in Windows® Vista (Part-2)

RECOMMENDED: If you have Windows errors then we strongly recommend that you download and run this (Windows) Repair Tool.

MIT Kerberos for Windows (KfW) is an integrated Kerberos release for Microsoft. the Ticket Initialization dialog may now optionally be preserved. A memory access error introduced in 2.6.1 has been eliminated. This problem was traced.

Nullsoft Scriptable Install System or NSIS is an open source tool that. data2.cab+has+Feature+Transfer+Error+. The NSIS package includes a basic compiler.

Apr 7, 2010. Hello, while I'm trying to build an mapsource installer with the –nsis option and makensis for the garmin all in one for europe I get the following error after a while with makensis: Internal compiler error #12345: error mmapping file (2141990789, 4569600) is out of range. Note: you may have one or two.

I'm getting the following error: Internal compiler error #12345: error mmapping datablock to 30661948. Note: you may have one or two (large) stale temporary file(s) left in your temporary directory (Generally this only happens on Windows 9x). I'm on Windows 10 so this shouldn't be an issue? I cleared my.

Windows applications in Visual Basic 5 Introduction. NSIS offers a scripting. the VB compiler allows you to set an existing project to not upgrade ActiveX.

I am using NSIS to create an installer for Java application to run on Windows platform. I would like to have the installer check for the current JRE version installed.

Make sure you save your program. Step 4: Compile and Execute a) Compile your program and eliminate all syntax errors. b) Build your program and verify the results of the program. Make corrections to the program logic if necessary.

Error 4099 Nov 15, 2009. Learn what other IT pros think about the 4099 Error event generated by AdsmClientService. Get answers to your event log question in minutes. I think judges have at times fallen into error, I think they have been flim-flammed by psychobabble and I think they have been conned by jail-cunning offenders. For all that I prefer the liberty

Dec 7, 2015. If you are reaching this page from an error message, you are having a problem installing a program. The downloaded file is either incomplete or modified from the original file. While this page will outline basic solutions: Please contact the publisher or developer of the program you are installing for complete.

Arrays You are encouraged to solve this task according to the task description, using any language you may know.

Microsoft Word Error Selection Is Locked Microsoft Office – Download The Complete Microsoft. you have Word open, head to File > Export > Create PDF/XPS Document. You’ll then enter the file manager. Browse to your desired save location. Note the Options button. Options include page range. Find out steps to fix How To: This Modification Is Not Allowed Because The Selection Is Locked. In MS Word

Browsers are giving different jquery errors in the. danger pmImgPopNoti col-sm-12">'+response.error+'</div. in the AST using the typescript compiler API?

I want to create an installation file which will open as wizard and install the program to C:/Program Files. At the end of the installation, I need to place an icon on the desktop and link it to the main program present in program files. I tried to do.

How does the Pac-12 compare? Here’s a breakdown of the number of top 25 crowds, by conference: SEC: 9 Big Ten: 7.

The NSIS package includes a basic compiler interface. If you work frequently with NSIS scripts you might want to download a more complete development environment.

Godaddy Ie7 Certificate Error Go Daddy – An affected website’s HTTPS encryption will still work even if its GoDaddy-issued certificate is revoked. However, visitors to your website may see error messages or warnings in their browser until a new certificate is installed. GoDaddy, Fix Godaddy Ie7 Certificate Error (Solved) – WinDock.org – Godaddy Ie7 Certificate Error. SynergyCitrix Tech SupportCitrix Workspace. Godaddy Certificate Not Trusted.

Usage Statistics for communitygaze.com – October. – Usage Statistics for communitygaze.com Summary Period: October 2017 – Search String Generated 17-Oct-2017 02:11 PDT

请教一个NSIS的问题,关于编译文件大小的【nsis吧】_百度贴吧 – 请教一个NSIS的问.需要编译一个1.7G左右的文件,但编译时产生如下信息: Internal compiler error #12345: error mmapping.

NSIS – Error checking. Installer behaviour commands (such as show/hide/wait/etc); User functions in script; Callback functions that let you customize the way the installer. Note that the NSIS development kit installer may have set up your computer so that you can compile a.nsi file by simply right-clicking on it in explorer, and.

Internal compiler error #12345. Not even close to 2GB Hi! I'm building an installer for a large application. My application data has been about 2.2 GB for quite some time now and there has been no problem to create an nsis installer exe for it. The installer uses compression so the final installer exe is about.

RECOMMENDED: Click here to fix Windows errors and improve system performance