Error While Building Project Qt

How to use Cmake with Qt Creator for Building C++ programs

RECOMMENDED: If you have Windows errors then we strongly recommend that you download and run this (Windows) Repair Tool.

Not a member of Pastebin yet?. Error while building/deploying project HelloWorld (kit: Desktop Qt 5.7.0 MSVC2015_64bit) When executing step "qmake" RAW Paste Data

Qt Creator Compiling Error at step 'make'. make error when building QT project from source. Error while building project when executing build step 'Make' 6. Qt.

You should install visual studio 2015 or vs c++ 2015 compiler so you can use vs compiler 2015 with Qt or use Qt with MinGW compiler.

Hey, I just installed Qt creator on my Mac and when I try to build default project (hello world) it shows the text: Error while building/deploying project untitled5.

Realm Of The Mad God Server Error 2048 Fixing RotMG Socket-Server Security: Error #2048. up vote 0 down vote favorite. Browse other questions tagged networking realm-of-the-mad-god or ask your own. Ms Access Vba Runtime Error 2455 Error 2455: you entered an expression that has an invalid reference. – Jan 24, 2011. I am trouble shooting this error , it occurs only if use close button at right top

No reviews matched the request. Check your Options in the drop-down menu of this sections header.

Dec 3, 2013. Remember, QtCreator needs two tools to make sure your project and. side) you can set the environment for the build click the PATH value.

Hello, So I recently downlaoded the Qt GUI editor and I get this error when trying to build and run it.: 22:21:33: Running steps for project.

Jul 27, 2017. Is there a known issue with latest Qt Creator? I have done. Error while building/ deploying project platformio (kit: Desktop Qt 5.9.1 GCC 64bit)

Can’t Build Anything – "Error processing project file. – Jan 05, 2009  · Error processing project file: D:/. Error while building project blah When executing build step ‘QMake’. haven’t used QT Creator myself,

(CNN)– Peter. ahead of building projects across the world. Similar processes are being developed to build in the most challenging environments. British architects see an opportunity to cultivate new life in deserts, while NASA believe.

And then there is the issue of margin of error. While the NHB Residex would provide unit rates. of locations in Indian cities tends to be a mishmash of different building styles and project specifications, with very old buildings existing.

Solve qmake error when import project to another machine-Qt | How. – This trick will make your Qt Creator to build/compile your program when you move the entire project to another computer and return qmake error at compiling.

Hi guys, I am having problem deploying a simple qml project. I encountered this error: Error while building/deploying project test (kit: Android for armeabi-v7a.

In the filing, the district and its building. building projects — claims that the New York Mellon Trust Co., N.A. honored a $120,882.83 payment request that failed to follow established procedures and was allegedly requested while the.

How to set a compiler in Qt?. Error while building/deploying project. If you are a beginner I recommend you download the MinGW version from qt-project.org and.

Experts point to a number of likely reasons for the corbels giving way In most construction failures, human error ranks. infrastructural projects here, it was not apparent. The worksite had a clean safety record until yesterday. While the.

Ms Access Vba Runtime Error 2455 Error 2455: you entered an expression that has an invalid reference. – Jan 24, 2011. I am trouble shooting this error , it occurs only if use close button at right top corner to close my access, that time i have a form open with two. Microsoft Access. The Microsoft Access. If you can, test it by commenting out the
Error Creating Assembly Archive Sep 21, 2017  · PDF files that contain the Visual Studio 2005 documentation. Caused by: org.apache.maven.plugin.MojoExecutionException: Failed to create assembly: Error creating assembly archive job: error in opening zip file. St. Joseph’s College, Bangalore – The car sees the world as an organized 3D code-space, and as an assembly of reflective objects that may interrupt. pulses off surrounding objects and. fabric8-maven-plugin

Connect With Contractors Near You. Get Up To Four Estimates For Free!

Hi All, I have installed Qt 5.0.2 on Ubuntu 13.04. While building i am getting this error @ /usr/bin/ld: cannot find -lGL collect2: error: ld returned 1 exit status.

Jun 05, 2015  · Qt Error. Thu Jun 04, 2015 1. Hi I am writing a UI with Qt on my Pi 2. I keep getting an error that says "Error while building/deploying project.

RECOMMENDED: Click here to fix Windows errors and improve system performance