Error Cs1525 Unexpected Symbol

Unity 3D 10 random errors: Part 1

RECOMMENDED: If you have Windows errors then we strongly recommend that you download and run this (Windows) Repair Tool.

How to fix Script? error CS1525: Unexpected symbol `Internal' – Unity is the ultimate game development platform. Use Unity to build high-quality 3D and 2D games, deploy them across mobile, desktop, VR/AR, consoles or the Web, and.

Assets/Custom Scripts/Swimming V2.cs(22,9): error CS1525: Unexpected symbol `}' i cant fix this error no matter how much i try. I try to put a ';'.

Jul 20, 2015. CS1525.cs class x { public static void Main() { int i = 0; i = i + // OK – identifier 'c' + // OK – character (5) + // OK – parenthesis [ + // CS1525, operator not a valid expression element throw + // CS1525, keyword not allowed in expression void; // CS1525, void not allowed in expression } }. An empty label can also.

BuildReport 插件导入unity脚本报错(BRT_Util.cs:error CS1525. – BuildReport 插件导入unity脚本报错(BRT_Util.cs:error CS1525: Unexpected symbol `;', expecting `)', or `,'). 原创 2014年07月23日10:39:23. 标签:; unity /; MONO /; BuildReport /; 插件 /. 4333; 编辑; 删除. 在unity中想必都用过很多种类的 插件,在这里说一下再用BuildReport 插件,导入Unity时发生的一个错误;. 报错是 因为插件中的.

Cisco Vpn Error 53 Cisco VPN Troubleshooting on Windows – Uninstall and then. – Cisco VPN Troubleshooting on Windows – Uninstall and then Reinstall the VPN Client. Last Updated: 08/15/2017. Back to: Layout: One Column: Two Column. Error 619 when trying to connect with Windows VPN client. 53. James. 86 1 1 9. to Cisco Router RV042 (Server) May 24, 2013. Setup UseRasCredentials=0 as

Participate in discussions with other Treehouse members and learn.

【Unity エラー】CS1525 : コードに全角スペースなど – やまめも – 2015年5月6日. コード中に全角のスペースが入っている場合が多い。 (「;」がないとかの可能性もあり) 例1 error CS1525: Unexpected symbol ` ' 例2 error CS1525: Unexpected symbol `iTween' IEnumerator ButtonBombUnl…

Feb 27, 2015. Test case: u0001namespace Test { class T1 { static void Main(string[] args) { } } } mono c# compiler output: error CS1525: Unexpected symbol `namespace' visual c# compiler output: error CS1056: Unexpected character 'u0020' Microsoft's compiler output is a way better than mono's in that case – it displays.

Unity is the ultimate game development platform. Use Unity to build high-quality 3D and 2D games, deploy them across mobile, desktop, VR/AR, consoles or the Web, and.

Compiler Error CS1525 "end of file. Unity Editor Script: error CS1525: Unexpected symbol `<internal>' 0. unexpected symbol 'public' while creating float. 0.

Apr 1, 2017. Settings.cs(1,93): error CS1525: Unexpected symbol `/' Settings.cs(1,114): error CS1012: Too many characters in character literal. They or something probably added the first line wrongly. To fix it, comment out the first line at./gnome-sharp/ src/gnome-sharp-2.24.3/sample/gconf/Setting.cs and go to.

Nov 7, 2010. Ok, so, this is using C# in Unity, but I believe this is a C# problem, not a Unity problem. Anyways, the error is: Assets/Assets/Scripts/Player/PlayerGUI.cs(92,42): error CS0178: Invalid rank specifier: expected `,' or `]' Assets/Assets/Scripts/ Player/PlayerGUI.cs(92115): error CS1525: Unexpected symbol.

2000 Ford Expedition Error Codes I have a 2000 Ford Expedition with a 5.4L V8. Codes P0171 and P0174 came up on my scan tool a few weeks ago. One of them – Answered by a verified Ford Mechanic eHow Auto gets you on the fast track with repair, maintenance, and shopping advice. Whether you’re jump starting a battery or insuring a new car, we

My code is returning the following error:. (13,101): error CS1525: Unexpected symbol platformSpeed', expecting(', ). error CS1525: Unexpected symbol `<internal>' 0.

RECOMMENDED: Click here to fix Windows errors and improve system performance