Error C2513

RECOMMENDED: If you have Windows errors then we strongly recommend that you download and run this (Windows) Repair Tool.

Apr 6, 2014. streql.c(27) : error C2513: '/global/ ' : no variable declared before '=' streql.c(51) : error C2065: 'streql_methods' : undeclared identifier

View and Download Panasonic DMR-EZ49VEG service manual online. DMR-EZ49VEG DVD Recorder pdf manual download.

Jan 24, 2016. Hi, I got some error during install bleno and I found that might be some issue. srcdevice.cc(253): error C2513: '': no variable declared before.

I am getting this annoying error and I don't know why =( ! This is the question , I solved it but I am having a problem with the constructor. Write a program that.

Mar 10, 2011. I try to use your code but visual studio said that: error C2065: 'draw_square':. error C2513: '/ * global * / ': no variable declared before '='.

im new to c++ and I wanted to call a class/function from a second.cpp page. error: error C2512: 'QueryAuthServer' : no appropriate default constructor available.

c++ – Can't name variables "far" and "near" when using GLAD. – When I include glad.h in any file, variable names of near and far can't be used. It results in an expected an identifier , and Error C2513 no.

No default constructor is available for the specified class, structure, or union. The compiler supplies a default constructor only if user-defined constructors are.

An alternative would be to delete typedef to define a variable with aggregate initializer list, but this is not recommended because it will create a variable with the.

Compiler Error C2513 | Microsoft Docs – 'type' : no variable declared before '=' The type specifier appears in declaration with no variable identifier. The following sample generates C2513: // C2513.cpp int.

WordPress Error 404 Page Not Found Apr 15, 2011  · Can you please look at the handler mappings for *.REM – specifically for the vdir or site where your remoting application reside? Make sure it’s mapped. Here is how you can easily fix the WordPress posts 404. In this article we will show you how to fix WordPress posts returning 404. the home page still not found.

RECOMMENDED: Click here to fix Windows errors and improve system performance