Error C2332

Breville You Brew Coffee Maker Repair

RECOMMENDED: If you have Windows errors then we strongly recommend that you download and run this (Windows) Repair Tool.

Compiler Errors C2300 Through C2398 Compiler Error C2332. Compiler Error C2332. Compiler Error C2332. Compiler Error C2300. Compiler Error C2301. Compiler Error C2302.

2016年11月28日. visualC++ 2015でenum classを使いたいのですがビルドが通らず困っています。 もし 、必要な設定などあれば教えていただけるとありがたいです。 enum class hoge { hogehoge, hogehogehoge, };. エラー一覧 1>d:.: error C2332: 'enum' : タグ名が ありません 1>d:.: error C2236: 予期しない 'class' 'hoge' です。';' が入力.

Hello I was trying to compile my linux project on windows. Anyway I have gotten so long that the VC 8.0 compiler and mingw (i was trying both) they both.

View and Download Integra RDC-7.1 service manual online. AV Controller. RDC-7.1 Music Equipment pdf manual download.

Nature Genetics – In the mouse cochlea, whirlin is expressed in the sensory IHC and OHC stereocilia. Our findings suggest that this novel.

Vray Error Cannot Create Bitmap ScriptSpot is a diverse online community of artists and developers who come together to find and share scripts that empower their creativity with 3ds Max. Nov 24, 2017  · Welcome to the CADTutor forums, probably the most lively and friendly AutoCAD forums on the web. You will need to register in order to. bitmaps F11 MaxScript Listener->type: FreeSceneBitmaps()8. fix "Error Creating
Ios 7 Unknown Error 9006 The iPhone [device name] could not be restored. An unknown error occurred (9). On an iPhone 7 or iPhone 7 Plus, in Apple Support Communities. Before iOS 7 it was rather inconvenient to block a phone number. The Block this Caller button is located all the way down towards the bottom of the info page. To block that unknown number,

2014年1月18日. 3つのプロジェクトで構成されているソリューションがあり、各プロジェクトに正しくリンクの 設定したのですが以下のエラーが出てつまずいています。原因がわかるかた いらっしゃいましたらコメントよろしくお願いします。 rogram files (x86)microsoft sdks windowsv7.0aincludemmreg.h(2347): error C2332: 'struct' : タグ名が.

Prompt to a teapot how to start a local runner from under IntelliJ IDEA ? the menu command run 'Runner' leads to the error: Exception in thread “main” java.net. ConnectException:. Swears by the first counter of enum: “error C2332: 'enum' : missing tag name”, “error C2236: unexpected 'class' 'model::ActionType'. Did you.

gamecontroller.cc 3>c:privatedatenwidelandswideland- repotrunksrcgamecontroller.h(30): error C2332: 'enum': Fehlender Tagname 3>c: privatedatenwidelandswideland-repotrunksrcgamecontroller.h(30): error C2236: "class" "Widelands: face-tongue.png layerEndResult" unerwartet. Wurde ein ".

Compiler Error C2338 – msdn.microsoft.com – Compiler Errors C2300 Through C2399 Compiler Error C2338. Compiler Error C2338. Compiler Error C2338. Compiler Error C2332. Compiler Error C2333. Compiler Error.

gerrit.openbmc-project Code Review – ID, Subject, Status, Owner, Project, Branch, Updated, Size. Outgoing reviews. ( None). Incoming reviews. (None). Recently closed. (None). Powered by Gerrit Code Review (2.12.2) | Press '?' to view keyboard shortcuts. Working. Settings Sign Out. Code Review – Error. Continue. Code Review – Error. Continue.

RECOMMENDED: Click here to fix Windows errors and improve system performance