Error C2133

Configuracion del tomcat, compilar un servlet.

RECOMMENDED: If you have Windows errors then we strongly recommend that you download and run this (Windows) Repair Tool.

C言語初心者です。入力された値を配列の要素数にしたいのですが. – error c2466 : サイズが0の配列を割り当てまたは宣言しようとしました。 error c2057 : 定数式が必要です。 error c2466 : サイズが0の配列を割り当てまたは宣言しようとしま した。 error c2087 : 'array' : 添字がありません。 error c2133 : 'array' : サイズが不明 です。 教えてくれる人が周りにいなくて大変困っています。よろしく.

Calculating Error Rate Running Record Calculating Solar Panel Output – Best Type Of Solar Panel Poly Or Mono Calculating Solar Panel Output Solar Panel With Inverter Built In Solar Power System Australia Running Record Apps for the Classroom – Clever Classroom Blog – Jul 19, 2014. The app provides embedded formulas for the accuracy and self-correction rate ( no need for a calculator!), but of

'identifier' : unknown size. An unsized array is declared as a member of a class, structure, union, or enumeration. The /Za (ANSI C) option does not allow unsized.

Microsoft Visual C++ error error C2057,error C2133,error. – Oct 25, 2004  · I’m writing very simple code for an array and i get this error.can anyone help? it seems to have to do with my array and the fact that i’m using double.

Array unknown size (error C2133) Kroms. Hey all. I have to write a program that tests whether or not an array of chars is a palindrome (where a word is read the same.

Compiler Error C2133. Compiler Error C2133. Compiler Error C2100. Compiler Error C2101. Compiler Error C2102. Compiler Error C2103. Compiler Error C2104. Compiler.

(C2020 Arley Lane, School Lane & Frenchman’s Street, Bewdley) (Temporary Closure) Order 2016 Proposed Order: to close that part of C2020 Arley Lane, School Lane & Frenchman’s Street, Bewdley from its junction with C2133 Lion.

2>C:PCLpcl 1.7surfacesrcon_nurbsfitting_surface_pdm.cpp(542): error C2466: cannot allocate an array of constant size 0. 2>C:PCLpcl 1.7surfacesrc on_nurbsfitting_surface_pdm.cpp(542): error C2133: 'N0' : unknown size. 2>C: PCLpcl 1.7surfacesrcon_nurbsfitting_surface_pdm.cpp(543): error.

Compiler Error C2133 (Windows CE 5.0) – msdn.microsoft.com – Compiler Errors C2100 through C2199 Compiler Error C2133. Compiler Error C2133. Compiler Error C2133. Compiler Error C2100. Compiler Error C2101. Compiler Error C2102.

C:SMM6.4POCKETPCVC++TestTest.cpp(159) : error C2955: 'CComPtr' : use of class template requires template argument list. C:Windows CE Toolswce300 Pocket PC 2002atlincludeatlbase.h(674) : see declaration of 'CComPtr' C: SMM6.4POCKETPCVC++TestTest.cpp(159) : error C2133:.

2013年10月3日. gccではコンパイルできたのにVC++だとコンパイルできない(配列). //例1 int array1[]; // → コンパイルエラー int array2[][]; //→ コンパイルエラー int array3[][][]; //→ コンパイル エラー int array4[][][][][]; //→ コンパイルエラー /* error C2133: 'array1' : サイズが不明 です。 error C2087: 'array2' : 添字がありません。 error C2133:.

Jul 23, 2014. hexrd/transformstransforms_CFUNC.c(774) : error C2466: cannot allocate an array of constant size 0. hexrd/transformstransforms_CFUNC.c(774) : error C2133: 'q2s' : unknown size. hexrd/transformstransforms_CFUNC.c(795) : error C2065: 'NAN' : undeclared identifier. error: command 'C:\Program Files.

sourcesrcbnetdcommand.cpp(139) : error C2133: username: неизвестный размер 1>…sourcesrcbnetdcommand.cpp(141) : error C2065: USER_NAME_MAX: необъявленный идентификатор 1>…sourcesrcbnetd command.cpp(784) : warning C4146: применение унарного минуса к типу без.

C++ array size dependent on function parameter causes compile errors. Ask Question. up vote 16 down vote favorite. 3. error C2133: 'a' : unknown size.

Compiler Errors C2100 through C2199. Compiler Error C2133 ‘identifier’: unknown size: Compiler Error C2134. syntax error: missing ‘token.

C2133: Unknown size [closed] Ask Question. Error 11 error C2133: 'WorkerList' : unknown size. The error is found in the main section. I also do not know why.

Canon Pixma Mg3120 Error Codes Aug 21, 2012. Printer Canon Pixma Pro9500: 2 flashing orange lights. April 30, 2014 3:47 PM. When you have two flashing orange lights with a Canon Pixmaz Pro9500, with error code 1000, 1001 or 1002, it means: Solution 1: · There is no paper (ASF). · Set the paper in ASF and press "Resume/Cancel" button. Solution. View and Download Canon

Compiler Errors C2100 through C2199 Compiler Error C2143. Compiler Error C2143. Compiler Error C2143. Compiler Error C2133. Compiler Error C2134. Compiler Error.

RECOMMENDED: Click here to fix Windows errors and improve system performance