Error 4 Type Or Namespace Definition Or End-of-file Expected

Part 8  Data access in mvc using entity framework

RECOMMENDED: If you have Windows errors then we strongly recommend that you download and run this (Windows) Repair Tool.

Jun 6, 2012. Hi all I keep getting error code CS0116 & CS0122 in CSharp. ***ERROR CODE CS1016:namespace does not directly contain members***; if (mHealth <=0); mHealth =amount;; } ***ERROR CODE CS1022:Type or namespace definition, or end-of-file expected***; {; die();; public. Add comment · Show 4.

Microsoft Access 2010 comprehensive list all Error Numbers and Descriptions

In the error hex codes; there is a first part called the HRESULT values (0x0000XXX) that shows the type of error. System error codes. 0, 0x00000000, The operation.

Ms Word Compile Error In Hidden Module Autoexec If you’ve seen them all and heard them all from your past computer use then you’re definitely a seasoned Windows user. With Windows 10 scheduled for release later this year, it doesn’t look like Microsoft’s operating system is going away. Apr 28, 2005  · I’m getting the following error after opening any office program(s), such as; Word, Excel, Outlook. MS Visual

Arachnode.net is an open source Web crawler for downloading, indexing and storing Internet content including e-mail addresses, files, hyperlinks, images, and Web pages.

Sep 25, 2017. C:_prja1>dotnet build Microsoft (R) Build Engine version 15.3.409.57025 for. CS1513: } expected [/home/omajid/temp/HelloWorld/HelloWorld.csproj] Program. cs(11,1): error CS1022: Type or namespace definition, or end-of-file expected. Moving this to Roslyn for now to see if it is indeed a duplicate.

The type or namespace name could not be found. 0. Type or namespace definition, or end-of-file expected error-4. Type or namespace definition, or end-of-file.

Adobe Reader Error In Internet Explorer 8 Syntax Error Help How to identify and fix common syntax errors – Drupal Video Tutorial. – So in this video, what we're going to do is talk through some of the most common errors and give you a sense of how you can identify where the problem is depending on the kind of error. So let's go ahead and jump

"Type or namespace definition, or end-of-file expected. 480e-a107-7ac0eca23213/type-or-namespace-definition-or-endoffile. end before the next.

This manual is for R, version 3.4.1 (2017-06-30). Copyright © 2000–2016 R Core Team. When programming in the R language the type of an object generally doesn’t affect the computations, however, when dealing with foreign languages.

Invalid token at empty line – Developer Community – Developer Community for Visual Studio Product family. I edited the program around, even making sure that the line with the error has no code at all. or interface member declaration 2>Program.cs(37,1,37,2): error CS1022: Type or namespace definition, or end-of-file expected 2>Done building project.

Hi, I am getting this mentioned error after converting a VB program to C#, but I cant seem to find the missing right bracket. I counted them multiple times and it.

Experts Exchange > Questions > Type or namespace definition, or end-of-file expected error on class create. or end-of-file expected error on class create.

Aug 29, 2017. Pages_ViewStart.cshtml(1,2): error CS1022: Type or namespace definition, or end-of-file expected [D:DPCore20Core20.csproj]. If I try to build the project now I get compilation errors for Pages/_ViewImports.cshtml, and now that file has the Build Action set to "C# compiler". Repeating the actions above.

How To Fix Window Error Recovery Windows 7 Ubuntu Install End_request Io Error The world of web services has been on a fast track to supernova ever since the architect astronauts spotted another meme to rocket out of pragmatism and into the. How to Shorten Man Pages Into Readable Explanations on Linux and macOS – The tldr command on Ubuntu is. First, we need to install NodeJS and

>type or namespace definition, or end-of-file expected in c#. Error causes when a source code file does not have a matching set of braces. using System;; class Program; {; public static void Main(string[] args); {; string[] colorList = new string[ 10];; colorList[0] = "sunday";; colorList[1] = "monday";; colorList[2].

Gimpel Software’s PC-lint and FlexeLint On-Line Demos. On-Line Message Reference for FlexeLint and PC-lint (aka FlexeLint for Windows)

Severity Code Description Project File Line Suppression State Error CS1514 { expected Test6-4-Full C:UsersAl AndersonDocumentsVisual Studio 2017 ProjectsTest6-4-FullTest6-4-FullControllersHelloWorldController.cs 9 Active Error CS1022 Type or namespace definition, or end-of-file expected Test6-4-Full.

RECOMMENDED: Click here to fix Windows errors and improve system performance