Compiler Error C2859

RECOMMENDED: If you have Windows errors then we strongly recommend that you download and run this (Windows) Repair Tool.

C/C++ Building Reference C/C++ Build Errors Compiler Errors C2800 Through C2899. Compiler Errors C2800 Through C2899 Compiler Error C2859. Compiler.

May 6, 2008. srcagxOSGmain.cpp(1) : warning C4653: compiler option 'Optimizations (one or more of. includeagxOSGagx_rendering.h(1) : error C2859:.

The articles in this part of the documentation contain information about a subsection of the Visual C++ compiler errors. Compiler Error C2859:

Compiler Errors C2800 Through C2899 Compiler Error C2859. Compiler Error C2859. Compiler Error C2859. Compiler Error C2800. Compiler Error C2801. Compiler Error C2802.

so you will have to tell the compiler where to find this header file. Right-click on. tasks.c:2859: error: syntax error before '&' token.tasks.c: In.

Required Boolean Found Int 1 Error Note how there is still a compiler error for the moment– this is because your adapter and the required methods are actually. fun. 2 b) Represent the Boolean expression yz+xz with the help of NAND gates only.SALARY FROM ORGANISATION O. Verify using Truth Table. (iii) SELECT NAME.15) using K Map 3 d) Write SOP form of Function F(x.12. to whom
Automatic Liveupdate Error A system of automatic updates is built into the platform. It provides timely updates to new versions. This system can not be deactivated. Upon. – Live Update. This article provides details on frequestly asked questions about the MVPS HOSTS file NVIDIA Driver Downloads – Automatically Detect NVIDIA Products – We're sorry, the NVIDIA Smart Scan does not support your system

So I tried to build other projects and I found out I can't compile any of the. option '/Z7' inconsistent with precompiled header; error C2859:.

Sep 2, 2016. When using msfastbuild I get cl : Command line error D8021 : invalid numeric argument '/wd4714. Is there a. If not, any more information about OS/Compiler/ Toolchain that you have could be useful! Cheers, error C2859:.

filename is not the type file that was used when this precompiled header was created, recreate the precompiled header. The project database and precompiled header.

[CMake] 'NMake Makefiles' generate does not support parallel. – Sep 22, 2012. srclibslanguageutilsfakemetaobject.cpp : error C2859: > d:qpsoftprojects qtcreatorabinlanguageutils.pdb is. Rule for compiling CXX files.

Vpn Connection Failed With Error 621 Dial-up Networking DUNS Errors: A comprehensive list of Windows errors and solutions to many of these problems. 2005 Support Alerts and Advisories | InterSystems – Access InterSystems’ support alerts and advisories through 2005. This error means your PC failed to connect to the Windows Update servers. If you are using a VPN connection, disconnect from the network and turn off

RECOMMENDED: Click here to fix Windows errors and improve system performance